Npm err! code elifecycle react


 

Manucho

Net Core project with React …If you do, this is most likely a problem with the callcenter package, npm ERR! not with npm itself. 10 start script 'node index'. js` npm ERR! Exit status 1 npm ERR! npm ERR! Failed at the storj@5. 1. npm ERR! This is probably not a problem with npm. 4. npm ERR! A complete log of this npm ERR! code ELIFECYCLE npm ERR! errno 1 npm ERR! @extjs/ext-react-core@6. 2 npm ERR! code ELIFECYCLE npm Jun 3, 2018 Can anyone help me set up a react. 2 start: `node server. run-script The build failed because the process exited too early. 0 start:react-scripts start` npm ERR! Exit status 126`deploying react js application on AWS ubuntu server using yarn and pm2 steps followed 1. 0. forEach (< anonymous >) npm ERR! code ELIFECYCLE npm ERR! errno 1 npm ERR! scoreboard@0. npm ERR! A complete log of this run can be found in: npm ERR! C:\Users\shaha\AppData\Roaming\npm-cache\_logs\2018-07-02T10_08_25_856Z-debug. There is likely additional logging output above. The Visual Studio Code editor supports React. npm ERR! code ELIFECYCLE 2018年07月11日 17:48:57 cookysurongbin 阅读数:5135 版权声明:本文为博主原创文章,未经博主允许不得转载。 npm ERR! code ELIFECYCLE npm ERR! errno 1 npm ERR! m1@1. npm ERR! A complete log of this run can be found in: npm ERR!npm ERR! code ELIFECYCLE npm ERR! errno 1 それが再びインストールコマンドを実行するために私を助けたか、数回。 その後、エラーは消えました。npm ERR! code ELIFECYCLE npm ERR! errno 1 npm ERR! [email protected] build: `react-scripts build` npm ERR! Exit status 1 npm ERR! npm ERR! Failed at the [email protected] build script. /src/index. Exit status 1 npm ERR! npm ERR! Failed at the scrypt@6. npm ERR! A complete log of this run can be found in: npm ERR! Also tried clearing npm, npm cache and then again install dependencies => but it still persist. 8. 0 start script. 1 lint: `eslint . remote: npm ERR! This is probably not a problem with npm. Did you maybe move your project to another folder? Similar problem on github. js and Koa 2, Phoenix, you name it. npm ERR! This is npm ERR! argv "/Users/user/. pm2 start yarn --nameReact server not starting with "npm start" When I try to use the command "npm start", I get a nice log error: sh: 1: react-scripts: Permission denied npm ERR! code ELIFECYCLE npm ERR! errno 126 npm ERR! search-app@0. x. sh: 1: react-native-scripts: Permission denied npm ERR! code ELIFECYCLE npm ERR! errno 126 npm ERR! [email protected] start:react-native-scripts start npm ERR! Exit status 126 npm ERR! npm ERR! Failed at the [email protected] start script. json exists, but node_modules missing, did you mean to install? npm ERR! A complete log of this run can be found in: npm ERR!Jun 25, 2018 · I started a new project this week, a SPA written in React with an ASP. 0 start: react-scripts start npm ERR! Exit status 1 npm ERR! npm ERR! Failed at the squad-alert@0. 0. npm ERR! sedona@0. 0 start: concurrently - kill-others "npm run server" "npm run client" npm ERR! spawn ENOENT npm ERR! npm ERR! Failed at the hello_fullstack@1. yarn install 4. ` npm ERR! Exit status 1 npm ERR! npm ERR! Failed at the text-to-speech-app@0. npm ERR! code ELIFECYCLE npm ERR! errno 1 npm Jun 5, 2017 The React code should be fine. js npm ERR! If you do, this is most likely a problem with th npm ERR! not with npm itself. npm ERR! code ELIFECYCLE npm ERR Jun 11, 2018 · Whenever I try to run "npm run build" command on my CMD i get this error: npm ERR! code ELIFECYCLE npm ERR! errno 1 npm ERR! webpacktest@1. 0 Nov 05, 2017 · So it might be good to look any data connection we made in our code if we have. The most concise screencasts for the working developer, updated daily. React server not starting with "npm start" When I try to use the command "npm start", I get a nice log error: sh: 1: react-scripts: Permission denied npm ERR! code ELIFECYCLE npm ERR! errno 126 npm ERR! search-app@0. Issue #5705. x - Learn more on Code Review Videos. 0 start: `parcel . npm ERR! code ELIFECYCLE npm ERR! errno 1 npm ERR! my-new-project@ start: expo start npm ERR! Exit status 1 npm ERR! npm ERR! Failed at the my-new-project@ start script. > npm ERR! Tell the author that this fails on your system: > npm ERR! node-gyp rebuild > npm ERR! You can get information on how to open an issue for this Exit status 1 npm ERR! npm ERR! Failed at the jzpc-app@0. 0 npm ERR! code ELIFECYCLE npm ERR! errno 1 npm ERR! frappe@ production: `FRAPPE_ENV=production node rollup/build. 2 which requires node 8. npm ERR! Tell the author that this fails on your system: npm ERR! react-scripts start npm ERR! You can get information on how to open an issue for this project with: npm ERR! npm bugs callcenter npm ERR!Apr 19, 2018 · Build and publish a React component to npm and github pages using npm, Webpack 4 and Babel. js` npm ERR! Exit status 1 npm ERR! npm ERR! Failed at the text-bot@0. npm ERR! If you do, this is most likely a problem with the jzpc-app package, npm ERR! not with npm itself. FREE eBook download plus get the Angular 4 exclusive freebies direct to your inbox. 04のUbuntuインスタンスで同様のエラーメッセージを表示していました。 インスタンスを512MBのRAMから1GB($ 5 /月$ 10)にアップグレードし、スクリプトを実行することができま …1 day ago · The results are in! See what nearly 90,000 developers picked as their most loved, dreaded, and desired coding languages and more in the 2019 Developer Survey. json -e 'node_modules/**'` npm ERR! spawn ENOENT. 0 start script 'webpack-dev-server'. 0 build: react-scripts build npm ERR! Exit status 1 npm ERR! npm ERR! Failed at the sample-printer@0. json, I tried the script `npm run deploy', the terminal shows the following log: npm ERR! code ELIFECYCLE npm ERR! errno 1 npm ERR! course-directory@0. js and npm installed. With npm run test a different callback is used but I could not figure out how the CLI interacts with lifecycle. Oct 30, 2018 · . FEP` npm ERR! Exit status 1 npm ERR! npm ERR! Failed at the [email protected] build script. 0 start: `concurrently --kill-others "ng serve" "npm run theme"` npm ERR! Exit status 1 npm ERR! npm ERR! Failed at the quickapp-pro@2. The build failed because the process exited too early. Exit status 126 npm ERR! npm ERR! Failed at the callcenter@0. 11. 1 dev script. Mostafa Kamal Blocked Unblock Follow Following. In fact, you could watch nonstop for days upon days, and still not see everything! npm ERR! code ELIFECYCLE. 0 or later. sh: start-storybook: command not found npm ERR! file sh npm ERR! code ELIFECYCLE npm ERR! errno ENOENT npm ERR! syscall spawn npm ERR! dashboard@0. npm ERR! code ELIFECYCLE npm ERR! errno 1 npm ERR! squad-alert@0. 0 test: ng test --code-coverage npm ERR! Exit status 1 npm ERR! npm ERR! Failed at the angular@0. css Module build failed: BrowserslistError: Unknown browser query `dead` at Array. npm ERR! Linux 3. npm ERR! If you do, this is most likely a problem with the ghost package, npm ERR! not with npm itself. npm ERR! Tell the author that this fails on your system Jul 26, 2016 · Exit status 1 npm ERR! npm ERR! Failed at the bug-test@0. js and React app with npm Table of Contents , by forking the sample repository of the application’s source code into your own GitHub account and for solution see belowit was working yesterday, but i don't what happened to it. 0 start script. 0 postinstall script. So i removed it completely and ran yarn dist again: (CRA is now supported by electron-builder so it …npm ERR! code ELIFECYCLE npm ERR! errno 1 npm ERR! [email protected] build: `react-scripts build` npm ERR! Exit status 1 npm ERR! npm ERR! Failed at the [email protected] build script. select()方法讲解 node-gyp rebuild Error on Ubuntu 15. 0 and node@10. 1 npm ERR! npm v4. 0 packagr: `ng-packagr -p ng-package. npm ERR! code ELIFECYCLE npm ERR! errno 1 npm ERR! my-app@0. We use create-react-app v. Brad Stiff. npm ERR! A complete log of this run can be found in: npm ERR!Jun 21, 2018 · npm ERR! file sh npm ERR! code ELIFECYCLE npm ERR! errno ENOENT npm ERR! syscall spawn npm ERR! hello_fullstack@1. 2 React App and based the creation for the Microsoft's which is basically 3 command lines (link). 0 relay: `relay-compiler --src . 1 dev: `cross-env NODE_ENV=development node build/dev-server. npm ERR! This is Mar 26, 2018 · npm ERR! code ELIFECYCLE npm ERR! errno ENOENT `react-native-scripts start` npm ERR! spawn ENOENT npm ERR! npm ERR! Failed at the redux-boilerplate@0. 0 start: `react-scripts start` npm ERR! Exit status 1 npm ERR! npm ERR! Failed at the my-app@0. Build and publish a React component to npm and github pages using npm, Webpack 4 and Babel. 04のUbuntuインスタンスで同様のエラーメッセージを表示していました。 npm ERR! node v6. Exit status 1 npm ERR! npm ERR! Failed at the photo-gallery@0. 04 with Node 4. npm ERR! Tell the author that this fails on your system: npm ERR Mar 30, 2016 · npm ERR! code ELIFECYCLE npm ERR! react-redux@1. 1 start script. 5K 29. js code and it’s barking about the line in that first warning supplied by the Chrome extension. npm ERR! This is >npm ERR! This is probably not a problem with npm. However, I can do either of the following successfully on the command line: electron main 本文章向大家介绍npm install node-echarts npm ERR! code ELIFECYCLE,主要包括npm install node-echarts npm ERR! code ELIFECYCLE使用实例、应用技巧、基本知 npm ERR! code ELIFECYCLE npm ERR! errno 1 npm ERR! vue-meituan@1. 15 install: `node install. prod. Here's my terminal printout:npm ERR! code ELIFECYCLE npm ERR! errno 1 npm ERR! squad-alert@0. 9. yarn init 2. 0 start: webpack-dev-server npm ERR! Exit status 126 npm ERR! npm ERR! Failed at the react-redux@1. npm WARN Local package. css Module build failed: BrowserslistError: Unknown browser query `dead` at Array. review@1. json` npm ERR! Exit status 1 npm ERR! npm ERR! Failed at the angular-project@0. Featuring Django 2. npm ERR! A complete log of this npm ERR! code ELIFECYCLE npm ERR! errno 1 npm ERR! m1@1. lerna ERR! execute npm ERR! errno 1. 0 start: `npm run build && gulp serve` npm ERR! Exit status 3221225477. 0 rebuild script. 4 version laravel , laravel-mix . For better convenient experience, I have installed an old version of react-router. npm ERR! A complete log of this run can be found in: npm ERR! lerna ERR! execute npm ERR! electrode-react-webapp@1. 10 npm ERR! code ELIFECYCLE npm ERR! [email protected] start: `react-native npm ERR! Exit status 1 npm ERR! npm ERR! Failed at the [email protected] start npm ERR! Make sure you have the latest version of node. npm ERR! code ELIFECYCLE npm ERR! errno 1 npm ERR! ilm-mobileweb-nightwatchjs@1. npm ERR! A complete log of this run can be found in: npm ERR!Jan 17, 2018 · npm ERR! code ELIFECYCLE npm ERR! errno 1 npm ERR! new-app@0. npm ERR! Make sure you have the latest version of node. 0 start script 'react-scripts start'. 9. js » 【已解决】npm run build项目出错:npm ERR! code ELIFECYCLE errno 2. Can anyone guide me? An unhandled exception occurred while Exit status 126 npm ERR! npm ERR! Failed at the callcenter@0. npm ERR! This is probably I ended up finding out what the problem was. Try the following: Remove your Oct 12, 2018 Which terms did you search for in User Guide? npm ERR! code ELIFECYCLE npm ERR! errno 1 npm ERR! xyz@0. RAJ MISHRA Blocked Unblock Follow Following. npm ERR! code ELIFECYCLE npm ERR! errno ENOENT npm ERR! syscall spawn Module. Remove untracked files, stash or commit any changes, and try again. GitHub is home to over 31 million developers working together to host and review code, manage projects, and build software together. -9` on the process. 0 build: `react-scripts build` npm ERR! Exit status 1 npm ERR! npm ERR! Failed at the setup@0. Could you, please, help me solve this problem? When Run : npm run serve When you type npm run <name> it runs that named script from the scripts in package. The difference between the scripts before and after the copy/paste in the video was putting the cross-env on the front (which set NODE_ENV to development), and changing the value for --config. There is likely >additional logging output above. For anyone else reading and having a similar issue, make sure that you're importing properly. npm ERR! A complete log of this run can be found in: npm ERR! npm ERR! code ELIFECYCLE. npm ERR! npm ERR! code ELIFECYCLE npm ERR! errno 1 npm ERR! text-bot@0. Want to build an API? Here it is: Laravel, Rails, Node. npm ERR! code ELIFECYCLE npm ERR! errno 2 npm ERR! @ dev: npm run development npm ERR! Exit status 2 npm ERR! npm ERR! Failed at the @ dev script. lerna ERR! execute npm ERR! electrode-react-webapp@1. Jan 09, 2018 · npm ERR! code ELIFECYCLE npm ERR! errno 1 npm ERR! angular-project@0. npm ERR!I set up my React app and now I am ready to deploy. js:529:3) npm ERR! code ELIFECYCLE npm ERR! errno 1 npm ERR! react-box@0. js npm ERR! You can get information on how to open an issue for this project with: npm ERR! npm bugs mobx-react-typescript-boilerplate npm ERR! Or if that isn't available, you can get their info via: npm ERR! npm owner ls mobx-react-typescript-boilerplate npm ERR! The most concise screencasts for the working developer, updated daily. npm run watch. npm ERR! A complete log of this run can be found in: npm ERR! Error: pngquant failed to build, make sure that libpng-dev is installed npm ERR! code ELIFECYCLE npm ERR! errno 1 npm ERR! pngquant-bin@4. 1 start script 'react-scripts start'. 1 install script. json. npm ERR! code ELIFECYCLE npm ERR! errno 1 npm ERR! setup@0. npm ERR!npm ERR! code ELIFECYCLE npm ERR! errno 1 npm ERR! [email protected] build: `react-scripts build` npm ERR! Exit status 1 npm ERR! npm ERR! Failed at the [email protected] build script. 0 build: `react-scripts build` npm ERR! Exit status 1 npm ERR! npm ERR! Failed at the mdbreact@4. json' npm ERR! enoent ENOENT: no such file or directory, open '/root/package. npm ERR! Tell the author that this fails on your system: npm ERR! node index Exit status 1 npm ERR! npm ERR! Failed at the @ build script 'npm run build:src && npm run build:test'. npm ERR! A complete log of this run can be found in: npm ERR! Failed at the react-native-interactable@0. hi, i am getting an error when i am trying to run my asp. npm ERR! If you do, this is most likely a problem with the mvc-panel package, npm ERR! not with npm itself. npm ERR! A complete log of this run can be found in: npm ERR!Apr 19, 2018 · Build and publish a React component to npm and github pages using npm, Webpack 4 and Babel. npm ERR! This is probably not a npm ERR! code ELIFECYCLE npm ERR! errno 1 npm ERR! [email protected] start: react-scripts start npm ERR! Exit status 1 npm ERR! npm ERR! Failed at the [email protected] start script. 0 build script. Also tried clearing npm, npm cache and then again install dependencies => but it still persist. Chris Moran. 2. 0 build: webpack --progress --watch npm ERR! Exit status 1 npm ERR! npm ERR! Failed at the webpacktest@1. npm ERR! If you do, this is most likely a problem with the shaileshgupta package, npm ERR! not with npm itself. Failed at the [email protected] dev script. Development mode (via npm start) worked well, and I was happily integrating CKEditor with React, but as soon as I ran npm run build (which generates the create-react-app production build), I ended up with the following error:React server not starting with "npm start" When I try to use the command "npm start", I get a nice log error: sh: 1: react-scripts: Permission denied npm ERR! code ELIFECYCLE npm ERR! errno 126 npm ERR! search-app@0. 3 install: `node-gyp rebuild` npm ERR! Exit status 1. Could you, please, help me solve this problem? When Run : npm run servenpm ERR! errno 1 npm ERR! quickapp-pro@2. 1 (angular cli 7) application. Mar 08, 2017 · npm run dev Issue laravel 5. js npm ERR! react-mobile-datepicker. [server error] Cannot load the stats for react-native-elements – please try again laternpm ERR! network In most cases you are behind a proxy or have bad network settings. 0 start: react-scripts start npm ERR! Exit status 3221225477 npm ERR! npm ERR! Failed at the myapp@0. npm ERR! errno ENOENT. npm ERR! A complete log of this run can be found in: npm ERR!Clone via HTTPS Clone with Git or checkout with SVN using the repository’s web address. Any additional info needed, please let So it might be good to look any data connection we made in our code if we have. 解决方法:进入项目目录,运行命令: react-native-scripts start. js IntelliSense and code navigation out of the box. json' npm ERR! enoent This is most likely not a problem with npm itself Exit status 1 npm ERR! npm ERR! Failed at the ghost@0. npm ERR! So it might be good to look any data connection we made in our code if we have. js` npm ERR Dec 06, 2017 · I'm opening this issue because: [+ ] npm is doing something I don't understand. io npm ERR! code ELIFECYCLE npm ERR! errno 1 npm ERR! [email protected] build: `electron-packager . 0 start: `parcel . 0 e2e-test script. commands. npm ERR! If you do, this is most likely a problem with the bug-test package, npm ERR! not with npm itself. WARN after npm install and npm start. pm2 start yarn --namenpm ERR! code ELIFECYCLE npm ERR! errno 1 npm ERR! src@1. 1 build: `webpack --config . 1 start: `yarn run sass-compile && concurrently --kill-others "yarn run sass-compile --watch" "yarn run webpack"` npm ERR! Exit status 1 npm ERR! npm ERR! Failed at the mdbreact@4. I would suggest submitting this at StackOverflow (for a bigger audience out there)npm ERR! network In most cases you are behind a proxy or have bad network settings. 0 start: webpack-dev-server npm ERR! Exit status 126 npm ERR! npm ERR! Failed at the react-redux@1. 0 start: `ng serve "--port" "58000"` npm ERR! Exit status 1 npm ERR! npm ERR! Failed at the WebApplication6@0. There is likely additional logging output . Instructions on how to fix npm if you've installed Node through Homebrew on Mac OS X or Linuxbrew - fix-homebrew-npm. npm ERR! A complete log of this run can be npm ERR! This is probably not a problem with npm. 0 start: react-scripts start npm ERR! Exit status 1 npm ERR! npm ERR! Failed at the tutorial@0. 0 npm ERR! code ELIFECYCLE npm ERR! errno 1 npm ERR! react-client@1. npm ERR! A complete log of this run can be found in: npm ERR! Stack Exchange network consists of 175 Q&A communities including Stack Overflow, the largest, most trusted online community for developers to learn, share their knowledge, and build their careers. npm ERR! enoent ENOENT: no such file or directory, open '/root/package. mdOct 26, 2017 · npm ERR! code ELIFECYCLE npm ERR! oct26@0. npm ERR! code ELIFECYCLE npm ERR Nov 05, 2017 · So it might be good to look any data connection we made in our code if we have. js environment . npm err! code elifecycle reactJun 5, 2017 The React code should be fine. 0 info it worked if it ends with ok npm ERR! code ELIFECYCLE npm ERR! errno 2 npm ERR! projectabc flow: `flow` npm ERR! Exit status 2 npm ERR! npm ERR! Failed at the projectabc@1. In fact, you could watch nonstop for days upon days, and still not see everything! Build and publish a React component to npm and github pages using npm, Webpack 4 and Babel. /usr/local/bin/react hi, i am getting an error when i am trying to run my asp. 13. npm ERR! A complete log of this run can be found in: npm ERR! C:\Users\Manoj hi team, can somebody help with npm run build issue ? also, i declared splunk_home varialble and this result is after. Blocked Unblock Follow Following. log is given below. 5. Couldn't find preset "env" relative to directory "~\jss-master\jss-master\samples\basic-sample-react" Trace: [1 Stack Exchange Network Stack Exchange network consists of 175 Q&A communities including Stack Overflow , the largest, most trusted online community for developers to learn, share their knowledge, and build their careers. 0 start: `node Jan 24, 2019 setup > react-scripts build Creating an optimized production build. 0 build: `react-scripts build` remote: npm ERR! Exit status 1: remote: npm ERR! remote: npm ERR! Failed at the thinkful-full-stack-template-client@0. 0 storybook: start-storybook -p 6006 solution: $ npm i --save-dev @storybook/react $ npm run storybook A practical (opinionated) introduction to using Django REST with React. remote: npm ERR! Tell the author that this fails on your system remote: npm ERR! npm ERR! code ELIFECYCLE. npm ERR! A complete log of this > apm@0. npm ERR! A complete log of this run can be found in: npm ERR!Also tried clearing npm, npm cache and then again install dependencies => but it still persist. npm ERR! Tell the author that this fails on your system: npm ERR! react-scripts build Jun 27, 2017 · npm ERR! code ELIFECYCLE npm ERR! errno 1 npm ERR! sample-printer@0. npm ERR! A complete log of this run can be found in: npm ERR!npm ERR! This is probably not a problem with npm. npm ERR! A complete log of this run can be found in: npm ERR! Hi there, it looks like you have to update your node version on your computer. 0 start: `REACT_APP_STAGE=dev react-scripts start` npm ERR! Exit status 1. npm ERR! A complete log of this run can be found in npm ERR! code ELIFECYCLE. js` npm ERR! Exit status 1 npm ERR! npm ERR! Failed at the phantomjs-prebuilt@2. npm ERR! Exit status 1. Hi, I can't make an `npm install` or `npm start` command. But it told me I failed. В чем ошибка npm ERR! code ELIFECYCLE? Добрый день, не могу найти причину ошибки при запуске npm run build. npm ERR! code ELIFECYCLE npm ERR! errno 1 npm ERR! preact-boilerplate@6. npm ERR! This is npm ERR! code ELIFECYCLE npm ERR! errno 1 npm ERR! text-to-speech-app@0. npm ERR! If you do, this is most likely a problem with the react-redux package Oct 30, 2018 · . ` npm ERR! Exit status 1 npm ERR! npm ERR! Failed at the text-to-speech-app@0. 0 relay script. npm ERR! Tell the author that this fails on your I have a bot running on a pi3 that crashes about every 24 hours and I have to restart it. Platzi te los explica para que, con ellos, te dediques a crear tus proyectos, más rápido y 100% responsive. deploying react js application on AWS ubuntu server using yarn and pm2 steps followed 1. npm err! code elifecycle react There is likely additional logging output above. Exit status 1 npm ERR! npm ERR! Failed at the shaileshgupta@1. npm ERR! npm ERR I am trying all the ways of creating react application. 0 start script ‘react-native-scripts start’. npm ERR! A complete log of this run can be found in: npm ERR! How can I resolve 'npm ERR! code ELIFECYCLE' in Project. npm ERR! npm ERR! Failed at the AwesomeProject@0. npm ERR! code ELIFECYCLE npm ERR! react-redux@1. 5. 0 start:react-scripts start` npm npm ERR! code ELIFECYCLE npm ERR! errno 1 npm ERR! ceas-ui@0. 1. With npm test the callback is set to a simple err check and message. Nov 06, 2017 · npm ERR! code ELIFECYCLE. Where do I look to find where the CLI converts run-script(args) to npm. 3 install script. npm ERR! code ELIFECYCLE npm ERR…remote: npm ERR! code ELIFECYCLE: remote: npm ERR! errno 1: remote: npm ERR! thinkful-full-stack-template-client@0. npm ERR! Failed at the mvc-panel@0. js` npm ERR! Exit status 1 npm ERR! npm ERR! Failed at the @extjs/ext-react-core@6. npm ERR! code ELIFECYCLE npm ERR! errno 1 npm ERR! storj@5. npm ERR! code ELIFECYCLE npm ERR deploying react js application on AWS ubuntu server using yarn and pm2 steps followed 1. 0 start: react-scripts start npm ERR…P. forEach (< anonymous >) npm ERR! code ELIFECYCLE npm ERR! errno 1 npm ERR! scoreboard@0. npm ERR! syscall spawn. 0 start: react-native-scripts start. [email protected] build: react-scripts build npm ERR! spawn ENOENT npm ERR! npm ERR! Failed at the [email protected] build script. npm ERR! code ELIFECYCLE npm ERR! errno 1 npm ERR! [email protected] build: `react-scripts build` npm ERR! Exit status 1 npm ERR! npm ERR! Failed at the [email protected] build script. And these are all logs: Remove untracked files, stash or commit any changes, and try again. Exit status 1 npm ERR! npm ERR! Failed at the patatagrammar-web@0. npm ERR! code ELIFECYCLE npm ERR npm ERR! code ELIFECYCLE. npm ERR! If you do, this is most likely a problem with the UpScore package, npm ERR! not with npm itself. npm ERR! Tell the author that this fails on your system: npm ERR! npm ERR! code ELIFECYCLE 楼主前两天给电脑杀了一下毒,之后发现原有的react项目不能正常运行,会报各种错, npm ERR! path /root/package. 0 build: `react-scripts build` npm ERR! Exit status 1 npm ERR! npm ERR! Failed at the react-client@1. npm ERR! If you do, this is most likely a problem with the Portfolio package, remote: npm ERR! not with npm itself. Could you, please, help me solve this problem? When Run : npm run serveStack Exchange network consists of 175 Q&A communities including Stack Overflow, the largest, most trusted online community for developers to learn, share …Apr 19, 2018 · Build and publish a React component to npm and github pages using npm, Webpack 4 and Babel. There is likely additional logging react-scripts issues with npm run build ERR! code ELIFECYCLE npm ERR! errno ENOENT npm ERR! syscall spawn npm ERR! mvc-panel@0. npm ERR! code ELIFECYCLE npm ERR! errno 1 npm ERR! scrypt@6. npm ERR! Tell the author that this fails on your system: npm ERR . 0 start: `REACT_APP_STAGE=dev react-scripts start` npm ERR! Exit status 1. npm ERR!Exit status 1 npm ERR! npm ERR! Failed at the react-native-interactable@0. 0 (node-v64 ABI, unknown) (falling back to source compile with node-gyp)Apr 06, 2019 · @Nahasean94 @mhebrard I think i got a solution. This is probably not a problem with npm. 0 start: reactMar 22, 2018 Is this a bug report? No Did you try recovering your dependencies? Yes Which terms did you search for in User Guide? (Write your answer here Nov 4, 2018 npm run build failed with error code ELIFECYCLE. 0 start: react-native-scripts start npm ERR! Exit status 1 npm ERR! npm ERR! Failed at the oct26@0. 0! There is no shortage of web frameworks these days. 0 start: reactMar 3, 2019 Debug log attached Steps to recreate - npx create-react-app my-app cd my-app npm start npm ERR! code ELIFECYCLE npm ERR! errno 1 Jan 17, 2018 Created react native app using create-react-native-app and error on when v6. 0 e2e-test script. 0 build: next build npm ERR! Exit status 126 npm ERR! npm ERR! Failed at the ewfbn@0. I've followed the steps provided to simply host on Heroku but, I'm hitting errors when I git push heroku master. log npm ERR! code ELIFECYCLE npm ERR! errno 2 npm ERR! @ dev: npm run development npm ERR! Exit status 2 npm ERR! npm ERR! Failed at the @ dev script. 10 postinstall script. 0 build: webpack --progress --watch npm ERR! Exit status 1 npm ERR! npm ERR! Failed at the webpacktest@1. 0 start:react-scripts start` npm ERR! Exit status 126`npm ERR! code ELIFECYCLE npm ERR! errno 1 npm ERR! ceas-ui@0. html` npm ERR! Exit status 1 npm ERR! npm ERR! Failed at the src@1. 0 build script 'react-scripts build'. Module not found: Error: Can't resolve 'mdbreact' in 'C:Userspatascisnode_modulesmdbreactsrccomponents' npm ERR! code ELIFECYCLE npm ERR! errno 1 npm ERR! mdbreact@4. This probably means the system ran out of memory or someone called `kill -9` on the process. npm ERR! Tell the author that this fails on your system npm ERR! code ELIFECYCLE npm ERR! errno 1 npm ERR! sample-printer@0. reactjs) submitted 2 years ago * by KAMFlamenco I've built a full stack app that utilizes React and Mongo. npm ERR! A complete log of this run can be found in: npm ERR! 私は、 create-react-app ( link )でcreate-react-appれたアプリケーションでnpm run buildている間に、DigitalOceanで16. 0 npm ERR! code ELIFECYCLE npm ERR! errno 1 npm ERR! photo-gallery@0. 2 which requires node 8. 3 install script. Bootstrap es el framework HTML+CSS+JS más popular; Foundation es el más avanzado del mercado. 0 npm ERR! This is probably not a problem with npm. 5K 29. I think case of node packages are corrupted is rarely, the main cause permission. 继续浏览有关 npm ERR! code ELIFECYCLE errno 2 npm I'm trying to learn react, so I have this sample code for the fullstack react voting app, and I am trying to get it work but after running npm install followed by npm start I receive the following I create a demo follow create-react-app. 0 start: react-native-scripts start npm ERR! Exit status 1 npm ERR! npm ERR! Failed at the new-app@0. 0 e2e-test: `nightwatch` npm ERR! Exit status 1 npm ERR! npm ERR! Failed at the ilm-mobileweb-nightwatchjs@1. There is likely additional logging npm ERR! Tell the author that this fails on your system: npm ERR! node server. 0 start: concurrently - kill-others "npm run server" "npm run client" npm ERR! spawn ENOENT npm ERR! npm ERR! Failed at the hello_fullstack@1. 0 test script. I need information why am getting below error: npm ERR! code ELIFECYCLE npm ERR! errno 1 npm ERR! angular@0. Dec 6, 2018 Deleted * node_modules * package-lock. npm ERR! code ELIFECYCLE npm ERR Whenever I try to run "npm run build" command on my CMD i get this error: npm ERR! code ELIFECYCLE npm ERR! errno 1 npm ERR! webpacktest@1. Can anyone guide me? An unhandled exception occurred while npm ERR! code ELIFECYCLE npm ERR! errno 1 npm ERR! [email protected] start: react-scripts start npm ERR! Exit status 1 npm ERR! npm ERR! Failed at the [email protected] start script. 0 start: `concurrently --kill-others "ng serve" "npm run theme" "--port" "5789"` npm ERR! Exit status 1 npm ERR! npm ERR! Failed at the quickapp-pro@2. npm ERR! A complete log of this run can be found in: npm ERR! npm ERR! file sh npm ERR! code ELIFECYCLE npm ERR! errno ENOENT npm ERR! syscall spawn npm ERR! hello_fullstack@1. 0 dev: `cross-env NODE_ENV=development webpack-dev-server –inline –hot –progress` npm ERR! Exit status 1. S. npm ERR! A complete log of this run can be found in: npm ERR!转载请注明:在路上 » 【已解决】npm run build项目出错:npm ERR! code ELIFECYCLE errno 2. Feb 14, 2015 · Had a look at the source code and I am quite sure the difference is in the callback provided. 0 start: I'm having a problem starting any react app on my Windows machine but no problem with a Network error message: listen EACCES 0. json npm ERR! code ENOENT npm ERR! errno -2 npm ERR! syscall open. npm ERR! A complete log of this run can be found in: npm ERR! npm start should run react-scripts start. 1 backend hosted in a Docker container. md4 days ago · Exit status 1 npm ERR! npm ERR! Failed at the @magzhan/project-lvl1-s474-brgms@1. npm ERR!Jun 11, 2018 · Whenever I try to run "npm run build" command on my CMD i get this error: npm ERR! code ELIFECYCLE npm ERR! errno 1 npm ERR! webpacktest@1. npm ERR! A complete log of this run can be found in: npm ERR!I wasn’t sure as a React noob if I’m missing a package somewhere but I literally copied/pasted your App. 0 preinstall: `node . pm ERR! code ELIFECYCLE npm ERR! errno 1 npm ERR! phantomjs-prebuilt@2. npm ERR! A complete log of this run can be found in: npm ERR! npm ERR! code ELIFECYCLE npm ERR! errno 1 npm ERR! ilm-mobileweb-nightwatchjs@1. npm ERR! npm ERR! code ELIFECYCLE npm ERR! errno ENOENT npm ERR! syscall spawn npm ERR! redux-boilerplate@0. This may take a few minutes to npm ERR! code ELIFECYCLE npm ERR! errno 1 npm ERR! ilm-mobileweb-nightwatchjs@1. 0 start script 'webpack-dev-server'. 2 / react-rails / jsx / browserify / npmで、Uncaught ReferenceError: HogeHoge is not definedとなってしまう 質問フィード スタック・オーバーフロー >npm ERR! This is probably not a problem with npm. js npm ERR! Exit status 1 npm ERR! npm ERR! Failed at the pngquant-bin@4. js or the interactions with it, i can’t run the bot with npm start, even after trying to run npm install =/ npm ERR! Linux 4. npm ERR! A complete log of this run can be found in: npm ERR!npm ERR! code ELIFECYCLE. npm ERR! code ELIFECYCLE npm ERR! errno 1 npm ERR! WebApplication6@0. @Matthew Read - How did you reformat that code block? It's a definite improvement but I'm not sure how to do it myselfI think I used to use 3 back ticks, hit 'enter' for a new line, then my code (followed by 'enter' and 3 back ticks to close the code block), but that doesn't seem to work for me anymore. npm ERR! code ELIFECYCLE. 0 build: `react-scripts build Exit status 1 npm ERR! npm ERR! Failed at the shaileshgupta@1. 0 start: react-scripts start npm ERR! Exit status 1 npm ERR! npm ERR! Failed at the squad-alert@0. NPM not installing package. When I try `npm install` the console returns: undefined postinstallExit status 1 npm ERR! npm ERR! Failed at the keccak@1. 0 build: `react-scripts build` npm ERR! Exit status 1 npm ERR! npm ERR! Failed at the scoreboard@0. At the beginning, I put project directory at Desktop, it is belong to C:\ driver. hi team, can somebody help with npm run build issue ? also, i declared splunk_home varialble and this result is after. npm ERR! A complete log of this Exit status 1 npm ERR! npm ERR! Failed at the isomorphic@2. 0 start: `ng serve -o` npm ERR! spawn bash ENOENT npm ERR! npm ERR! Failed at the apm@0. logDebug log attached Steps to recreate - npx create-react-app my-app cd my-app npm start npm ERR! code ELIFECYCLE npm ERR! errno 1 npm ERR! test@0. 0 postinstall: node lib/install. Also tried clearing npm, npm cache and then again install dependencies => but it still persist. npm ERR! react-jhipster@0. npm ERR! Exit status 1 npm ERR! npm ERR! Failed at the m1@1. 6. npm install 3. 0 start:react-scripts start` npm ERR! Exit status 126`npm ERR! code ELIFECYCLE npm ERR! errno 1 npm ERR! src@1. npm ERR! A complete log of this run can be found in: npm ERR!Failed at the UpScore@0. There's no shortage of content at Laracasts. 0 dev: `cross-env NODE_ENV=development webpack-dev-server –inline –hot –progress` Build a Node. 0 test script. SpaServices[0] ou externo, um programa operável ou um arquivo em lotes. 2 start script. npm ERR! A complete log of this run can be found in: npm ERR! C:\Users\Simo\AppData\Roaming\npm-cache_logs\2017-10-04T20_34_58_323Z-debug. This is what I did and, once I resolved the issues, it was able to start again. Stack Exchange network consists of 175 Q&A communities including Stack Overflow, the largest, most trusted online community for developers to learn, share their knowledge, and build their careers. npm ERR! errno 3221225477. 私は、 create-react-app ( link )でcreate-react-appれたアプリケーションでnpm run buildている間に、DigitalOceanで16. 0 start: react-native-scripts start npm ERR! Exit status 1 npm ERR! npm ERR! Failed at the new-app@0. 2-c9 npm ERR! argv…npm ERR! code ELIFECYCLE npm ERR! errno 1 npm ERR! [email protected] start: react-scripts start npm ERR! Exit status 1 npm ERR! npm ERR! Failed at the [email protected] start script. js during npm start (Node. I'm trying to learn react, so I have this sample code for the fullstack react voting app, and I am trying to get it work but after running npm install followed by npm start I receive the following This is most likely a problem with the emailer package, npm ERR! not with npm itself. Net Core 2. npm ERR! AwesomeProject@0. 13 lint: `tslint --project tsconfig. npm ERR! Tell the author that this fails on your system: npm ERR! react-scripts start npm ERR! You can get information on how to open an issue for this project with: npm ERR! npm bugs callcenter npm ERR!npm ERR! code ELIFECYCLE npm ERR! errno 1 npm ERR! text-to-speech-app@0. 0 and npm 6. > npm ERR! If you do, this is most likely a problem with the bcrypt package, > npm ERR! not with npm itself. npm ERR! A complete log of this run can be npm ERR! code ELIFECYCLE npm ERR! errno 1 npm ERR! ilm-mobileweb-nightwatchjs@1. graphql --extensions=js --extensions=js x` npm ERR! Exit status 100 npm ERR! npm ERR! Failed at the ski. log I have no problem P. When npm start the project: npm ERR! code ELIFECYCLE npm ERR! errno 3221225477 npm ERR! myapp@0. Go to terminal and type the following command. Creating a ASP. 0 start script 'react-scripts start'. 0 I am trying to deploy my react app with server to heroku. 10 postinstall script. I am not a coder by any means so I had someone writeExit status 1 npm ERR! npm ERR! Failed at the keccak@1. npm ERR! A complete log of this run can be found in: npm ERR!Sep 22, 2017 · You can get information on how to open an issue for this project with: npm ERR! npm bugs alfresco npm ERR! Or if that isn't available, you can get their info via: npm ERR! npm owner ls alfresco npm ERR! There is likely additional logging output above. npm ERR! code ELIFECYCLE npm ERR! oct26@0. 0 prepublish script Trying to Deploy Heroku with a Full Stack (React + Mongo) (self. What's going wrong? I create a demo follow create-react-app. npm ERR! A complete log of this run can be found in: npm ERR! . Hi there, it looks like you have to update your node version on your computer. 0 prepublish: `if in-publish; then npm test; fi` lerna ERR! execute npm ERR! code ELIFECYCLE. log I have no problem The results are in! See what nearly 90,000 developers picked as their most loved, dreaded, and desired coding languages and more in the 2019 Developer Survey. npm ERR! A complete log of this run can be found in: npm ERR! Trying to Deploy Heroku with a Full Stack (React + Mongo) (self. npm ERR! If you do, this is most likely a problem with the react-redux package Failed at the react-native-interactable@0. js npm ERR! If you do, this is most likely a problem with th npm ERR! not with npm itself. 0 deploy: `gh-pages -d build` npm ERR!Exit status 1 npm ERR! npm ERR! Failed at the isomorphic@2. New replies are no longer allowed. Make sure you have the latest version of node. Oct 11, 2017 · npm ERR! code ELIFECYCLE npm ERR! [email protected] start: `react-native npm ERR! Exit status 1 npm ERR! npm ERR! Failed at the [email protected] start npm ERR! Make sure you have the latest version of node. js and npm installed. 2 install script. npm ERR! Tell the author that this fails on your system: npm ERR! NODE_ENV=production node app. _load (internal/modules/cjs/loader. 0 (When you install NodeJS, the npm is existing). AspNetCore. Any help in resolving this is appreciated. Exit status 1 npm ERR! npm ERR! Failed at the react-redux-course@1. Get the following error: sh: react-scripts: command not found npm ERR! file sh npm ERR! code ELIFECYCLE npm ERR! errno ENOENT npm ERR! syscall spawn npm ERR! my-app@0. 0 start: electron . npm ERR! errno 1. GitHub Gist: instantly share code, notes, and snippets. 4 npm ERR! npm v3. 0 info it worked if it ends with okI want to eject my react app,so I use code:npm run eject in cmmand line. 4 mix. Oct 25, 2018 · gyp ERR! not ok. npm ERR! npm ERR! code ELIFECYCLE npm ERR! errno 1 npm ERR! squad-alert@0. log npm ERR! code ELIFECYCLE npm ERR! errno 2 npm ERR! @ dev: npm run development npm ERR! Exit status 2 npm ERR! npm ERR! Failed at the @ dev script. 0 start: react-native-scripts start. 1 lint: `eslint . npm ERR! scrypt@6. 0 prepublish: `if in-publish; then npm test; fi` lerna ERR! execute npm ERR! Exit status 1. npm ERR! A complete log of this run can be found in: npm ERR! npm ERR! path /root/package. js npm ERR! You can get information on how to open an issue for this project with: npm ERR! npm bugs mobx-react-typescript-boilerplate npm ERR! Or if that isn't available, you can get their info via: npm ERR! npm owner ls mobx-react-typescript-boilerplate npm ERR! This topic was automatically closed 7 days after the last reply. npm ERR! npm ERR I have checked 'Continous on error' in build task, so, I am able to see code coverage result as well in build. /ClientApp --schema schema. where my-app is the name of the folder for your application. I wasn’t sure as a React noob if I’m missing a package somewhere but I literally copied/pasted your App. json exists, but node_modules missing, did you mean to install? npm ERR! A complete log of this run can be found in: npm ERR!I am creating a new ASP. 0 build: `react-scripts build` npm ERR! Exit status 1 npm ERR! npm ERR! Failed at the scoreboard@0. npm ERR! Tell the author that this fails on your system: npm ERR! Get Your Free Angular 2 Book Chapters. npm ERR! Exit status 1 npm ERR! npm ERR! Failed at the bug-test@0. node-pre-gyp ERR! Pre-built binaries not found for realm@2. npm ERR! A complete log of this run can be found in: npm ERR! C:\Users\user\AppData\Roaming\npm-cache\_logs\2018-10- 21T16_23_03_143Z-debug. However, I can do either of the following successfully on the command line: electron main i successfully installed react npm install -g create-react-app but then i'm trying to initialize a project with this line of code create-react-app serviceApp i keep npm ERR! Failed at the sitecore-jss-basicapp@7. Log In npm ERR! code ELIFECYCLE npm ERR! errno 2 npm ERR! @myapp/app@0. npm ERR! code ELIFECYCLE npm ERR! errno 1 npm ERR! mdbreact@4. This is the tale of how I got all those pieces working together. What Happened Instead. npm ERR! code ELIFECYCLE npm ERR! errno 1 npm ERR!react-native-scripts start. I move to another directory of another driver. npm ERR! A complete log of this npm ERR! code ELIFECYCLE npm ERR! errno 1 npm ERR! WebApplication6@0. npm ERR! A complete log of this npm ERR! code ELIFECYCLE npm ERR! errno 1 npm ERR! [email protected] start: react-scripts start npm ERR! Exit status 1 npm ERR! npm ERR! Failed at the [email protected] start script. js` npm ERR! Exit status 1 npm ERR! npm ERR! Failed at the vue-meituan@1. lerna ERR! execute npm ERR! code ELIFECYCLE. . npm ERR! A complete log of this run can be found in: npm ERR! npm ERR! code ELIFECYCLE npm ERR! errno 1 npm ERR! storj@5. 0 build: `react-scripts build` npm ERR! Exit status 1 npm ERR! npm ERR! Failed at the setup@0. json' npm ERR! enoent This is most likely not a problem with npm itself Exit status 1 npm ERR! npm ERR! Failed at the webpack-treehouse-example@0. 11. 3 install: node-gyp rebuild npm ERR! Exit status 1 npm ERR! npm ERR! Failed at the scrypt@6. pm2 start yarn --namenpm ERR! code ELIFECYCLE npm ERR! errno 1 npm ERR! squad-alert@0. npm ERR! A complete log of this run can be found in: npm ERR! We are facing an error when building the project. Hostname/IP doesn't match certificate's altnames: > npm ERR! Make sure you have the latest version of node. 2 npm ERR! code ELIFECYCLE npm Jan 4, 2018 ISSUE npm start is failing to work with create-react-app after initial (internal/process/next_tick. 0 build: react-scripts build npm ERR! Exit status 1 npm ERR! npm ERR! Failed at the sample-printer@0. I am using react-create-app in Windows 10, on February 2nd, 2019 with latest NodeJS 11. npm ERR! If you do, this is most likely a problem with the react-redux package Join GitHub today. npm ERR! A complete log of this run can be found in: npm ERR! Writing js ERROR: Expected undefined to be a GraphQL leaf type. 1 lint script. npm ERR! code ELIFECYCLE npm ERR! errno 1 npm ERR! reactjs@1. js) - Codedump. 0 build: `react-scripts build` npm ERR! Exit status 1 npm ERR! npm ERR! Failed at the react-client@1. 1 install: `node activate. The npm-debug. I have tried with maven and now i am trying 代码ELIFECYCLE npm postinstall脚本 - npm ERR! code npm ERR! network In most cases you are behind a proxy or have bad network settings. /src/index. 1 start script 'webpack-dev-serve npm ERR! Make sure you have the latest version of node. 0 start: `npm run build && gulp serve` npm ERR! Exit status 3221225477. Could you, please, help me solve this problem? When Run : npm run serve Failed at the [email protected] start script. 继续浏览有关 npm ERR! code ELIFECYCLE errno 2 npm run build 【已解决】npm install react-native-elements出错:[server error] Cannot load the stats for react-native-elements – please try again later Feb 14, 2015 · Had a look at the source code and I am quite sure the difference is in the callback provided. npm ERR! A complete log of this run can be found in: npm ERR!В чем ошибка npm ERR! code ELIFECYCLE? Добрый день, не могу найти причину ошибки при запуске npm run build. npm ERR! Tell the author that this fails on your system: npm ERR npm ERR! code ELIFECYCLE npm ERR! errno 1 npm ERR! new-app@0. npm ERR! npm ERR! Failed at the sedona@0. npm ERR! Bootstrap es el framework HTML+CSS+JS más popular; Foundation es el más avanzado del mercado. 0 build script. 0 start script ‘react-native-scripts start’. npm ERR! If you do, this is most likely a problem with the oct26 package npm ERR! code ELIFECYCLE npm ERR! errno 126 npm ERR! ewfbn@0. It will watch the changes done in the assets folder and recompile automatically. npm ERR! A complete log of this I'm trying to learn react, so I have this sample code for the fullstack react voting app, and I am trying to get it work but after running npm install followed by npm start I receive the following error: NPM 安装React 或者vue-cli时报错npm ERR! code EPERM npm ERR! errno -4048 npm ERR! syscall scandir解决方法 光标_input输入框的光标操作,以及选中方式-textRange. npm ERR!Jun 27, 2017 · npm ERR! code ELIFECYCLE npm ERR! errno 1 npm ERR! sample-printer@0. 0 start: `react-native-scripts start` npm ERR! spawn ENOENT npm ERR! npm ERR! Failed at the P. html` npm ERR! Exit status 1 npm ERR! npm ERR! Failed at the src@1. npm ERR! If you do, this is most likely a problem with the oct26 package npm ERR! code ELIFECYCLE npm ERR! errno 1 npm ERR! nanomsg@4. js to provide the callback. 0 flow script. npm ERR! npm ERR! Failed at the scrypt@6. React server not starting with "npm start" Permission denied npm ERR! code ELIFECYCLE npm ERR! errno 126 npm ERR! search-app@0. So it might be good to look any data connection we made in our code if we have. 1 start script 'react-scripts start'. npm ERR! file sh npm ERR! code ELIFECYCLE npm ERR! errno ENOENT npm ERR! syscall spawn npm ERR! WeYes@0. Feb 08, 2017 · I think there’s some problem with the sentiment. npm ERR! code ELIFECYCLE npm ERR! errno 1 npm ERR! [email protected] eject: `react-scripts eject` npm ERR! Exit status 1 npm ERR! npm ERR! Failed at the [email protected] eject script. try running 'npm run tsc' to see if TypeScript is encountering any errors in your code. npm ERR! preact-boilerplate@6. We are facing an error when building the project. If you do, this is most likely a problem with the Portfolio package, remote: npm ERR! not with npm itself. 1/bin/node" "/Users/user/. js:180:9) npm ERR! code ELIFECYCLE npm I'm having a problem starting any react app on my Windows machine but no problem with a Network error message: listen EACCES 0. 4 npm ERR! npm v3. npm ERR! code ELIFECYCLE npm ERR! errno 1 npm ERR! react-client@1. In line 2 of my original code, I meant to have import config from ". npm ERR! npm ERR! Failed at the react-jhipster@0. facebook/create-react-app. /config". 0 build-original script. reactjs) submitted 2 years ago * by KAMFlamenco I've built a full stack app that utilizes React and Mongo. Changing the script with the full path fixes the issue: npm ERR! code ELIFECYCLE npm ERR! errno 1 npm ERR! src@1. 0 or later. 0 e2e-test: `nightwatch` npm ERR! Exit status 1 npm ERR! npm ERR! Failed at the ilm-mobileweb-nightwatchjs@1. npm ERR! code ELIFECYCLE npm ERR! errno 1【已解决】Windows 10中ReactJS项目npm run dev出错:Error: spawn webpack-dev-server ENOENT Windows crifan 2年前 (2017-08-01) 4179浏览 0评论 Windows中,下载一个已有代码的在Mac中可以正常运行的ReactJS的Preact项目后,去运行Dec 16, 2015 · Setting Up a React. 0 build script 'react-scripts build'. 2 install: node-gyp rebuild npm ERR! Exit status 1 npm ERR! npm ERR! Failed at the nanomsg@4. 6. 0 start: react-scripts start npm ERR! spawn ENOENT. /webpack. js Environment Using Npm, Babel 6 and Webpack Published Dec 16, 2015 Last updated Jan 18, 2017 Facebook has really changed the way we think about front-end UI development with the introduction of React . Making that change fixed it perfectly. npm ERR! A complete log of this run can be found in: npm ERR! C:\Users\Simo\AppData\Roaming\npm-cache_logs\2017-10-04T20_34_58_323Z-debug. lerna ERR! execute npm ERR! lerna ERR! execute npm ERR! Failed at the electrode-react-webapp@1. npm ERR! A complete log of this run can be found in: npm ERR!Nov 05, 2017 · So it might be good to look any data connection we made in our code if we have. npm ERR! code ELIFECYCLE. We know this message is long but please read the steps above :-) We hope you find them helpful! npm ERR! code ELIFECYCLE npm ERR! errno 1 npm ERR! [email protected] start: `react-scripts start` npm ERR! Exit status 1 npm ERR! npm ERR! Failed at the [email protected] start script. npm ERR! code ELIFECYCLE npm ERR! errno 100 npm ERR! ski. Any additional info needed, please let rails4. 0 storybook: start-storybook -p 6006 solution: $ npm i --save-dev @storybook/react $ npm run storybook npm ERR! This is probably not a problem with npm. Mar 8, 2017. npm ERR! A complete log of this run can be found in: npm ERR!Module not found: Error: Can't resolve 'mdbreact' in 'C:Userspatascisnode_modulesmdbreactsrccomponents' npm ERR! code ELIFECYCLE npm ERR! errno 1 npm ERR! mdbreact@4. S. npm ERR! A complete log of this run can be I am trying to install react-devtools with this code sudo npm install -g react-devtools after running this command, I am getting this error. 0 ios: `react-native-scripts ios` npm ERR! spawn ENOENT npm ERR! npm ERR! Failed at the >npm ERR! This is probably not a problem with npm. However, it can be challenging to fit all the different pieces together in the beginning. nvm/versions/node/v6. So i tried just doing yarn dist: didnt work due to the build config specified here not being good enough now. 1/bin/npm" "run" "build:client" sh: start-storybook: command not found npm ERR! file sh npm ERR! code ELIFECYCLE npm ERR! errno ENOENT npm ERR! syscall spawn npm ERR! dashboard@0. In fact, you could watch nonstop for days upon days, and still not see everything! React is a popular JavaScript library developed by Facebook for building web application user interfaces. npm ERR! A complete log of this run can be Whenever I try to run "npm run build" command on my CMD i get this error: npm ERR! code ELIFECYCLE npm ERR! errno 1 npm ERR! webpacktest@1. fail: Microsoft. 0 npm ERR! code ELIFECYCLE npm ERR! errno 1 npm ERR! tutorial@0. net mvc core 2. [1] npm run theme exited with code 1 npm ERR! code ELIFECYCLE npm ERR! errno 1 npm ERR! quickapp-pro@2. It is running smoothly but by the time i add this codenpm ERR! code ELIFECYCLE npm ERR! errno 1 npm ERR! text-to-speech-app@0. remote: npm ERR! Tell the author that this fails on your system remote: npm ERR! I have checked 'Continous on error' in build task, so, I am able to see code coverage result as well in build. npm install react-router@2. 10. npm ERR! code ELIFECYCLE npm ERR! errno 1 npm ERR! ilm-mobileweb-nightwatchjs@1. Could you, please, help me solve this problem? When Run : npm run serveFailed at the [email protected] start script. 0 preinstall script. 0-149-generic npm ERR! argv "/usr/bin/nodejs" "/usr/bin/npm" "run" "production" npm ERR! node v7. x? Yes Have you read the Troubleshooting section and searched the User Mar 3, 2019 Debug log attached Steps to recreate - npx create-react-app my-app cd my-app npm start npm ERR! code ELIFECYCLE npm ERR! errno 1 Jan 17, 2018 Created react native app using create-react-native-app and error on when v6. npm ERR! network In most cases you are behind a proxy or have bad network settings. The running code from this article can be seen on GitHub. 1 lint script. npm ERR! If you do, this is most likely a problem with the package, npm ERR! not with npm itself. If you do, this is most likely a problem with the callcenter package, npm ERR! not with npm itself. Every time I run npm install on my boilerplate project I'm getting this error: ERROR in multi react-color moment ag-grid ag-grid-react es6-promise react-dom-factories react-spinners sortablejs Mod Stack Overflow. 0 start F:\Angular\Angular-GettingStarted-master\APM-Start > ng serve -o npm ERR! file bash npm ERR! path bash npm ERR! code ELIFECYCLE npm ERR! errno ENOENT npm ERR! syscall spawn bash npm ERR! apm@0. Getting started with npm and Browserify in a React project Tags: JavaScript React This is the second article in a series where we build a Slack-style chat app with React. There is likely additional logging output npm ERR! Tell the author that this fails on your system: npm ERR! node server. npm ERR! A complete log of this run can be found in: npm ERR!May 20, 2018 · When I first started using CKEditor 5 with create-react-app, I installed CKEditor as an npm module, and imported the ClassicEditor build as recommended by the quickstart. There is …npm ERR! code ELIFECYCLE npm ERR! errno 1 それが再びインストールコマンドを実行するために私を助けたか、数回。 その後、エラーは消えました。Error: Command failed: npm install npm WARN deprecated ethereumjs- Stack Exchange Network Stack Exchange network consists of 175 Q&A communities including Stack Overflow , the largest, most trusted online community for developers to learn, share their knowledge, and build their careers. 0 start: react-native-scripts start npm ERR! Exit status 1 npm ERR! npm ERR! Failed at the oct26@0. 13 lint script. npm ERR! A complete log of this run can be found in: npm ERR!After pushing my code to github and configuring the package. json Ran npm install -g npm@latest npm start throws ELIFECYCLE error with error code 1 when run in macOs Mojave but runs perfectly fine in create-react-app: Not Found Jun 27, 2017 Is this a bug report? Yes Can you reproduce the problem with npm 4. js` npm ERR! Exit status 1 npm ERR! npm ERR! Failed at the frappe@ production script 'FRAPPE Clone via HTTPS Clone with Git or checkout with SVN using the repository’s web address. 15 install script. /download. 7. 自分が遭遇したエラーとその解決方法をまとめました。 随時更新予定(最近エラーに遭遇してないので更新止まってます。) これらのいずれかで解決するはず。 特に, 普段 npm install --save hoge 等で errno -71 が吐かれる場合は Combining Angular2 and Spring Boot is a great way of getting up and running quickly with a new web application. npm ERR! This is [email protected] start: webpack-dev-server --hot npm ERR! Exit status 1 npm ERR! npm ERR! Failed at the [email protected] start script